Heptachlor epoxide

Kovats' RI, non-polar column, isothermal

View large format table.

Column type Active phase Temperature (C) I Reference Comment
PackedOV-1200.2023.Dubsky, Hána, et al., 1979Column length: 2. m
PackedOV-1210.2040.Dubsky, Hána, et al., 1979Column length: 2. m

Kovats' RI, non-polar column, custom temperature program

View large format table.

Column type Active phase I Reference Comment
PackedSE-302015.Ramsey, Lee, et al., 1980He, Chromosorb G HP (80-100 mesh); Column length: 1.5 m; Program: not specified

Van Den Dool and Kratz RI, non-polar column, temperature ramp

View large format table.

Column type Active phase I Reference Comment
CapillaryOV-11993.de Paoli, Taccheo-Barbina, et al., 199125. m/0.32 mm/0.10 μm, 160. C @ 1. min, 1. K/min; Tend: 240. C
CapillaryOV-11997.de Paoli, Taccheo-Barbina, et al., 199125. m/0.32 mm/0.10 μm, 160. C @ 1. min, 1. K/min; Tend: 240. C
CapillaryOV-11999.de Paoli, Taccheo-Barbina, et al., 199125. m/0.32 mm/0.10 μm, 160. C @ 1. min, 1.3 K/min; Tend: 240. C
CapillaryOV-12002.de Paoli, Taccheo-Barbina, et al., 199125. m/0.32 mm/0.10 μm, 160. C @ 1. min, 1.3 K/min; Tend: 240. C
CapillaryOV-11993.de Paoli, Taccheo-Barbina, et al., 199125. m/0.32 mm/0.10 μm, 160. C @ 1. min, 1.5 K/min; Tend: 240. C
CapillaryOV-11997.de Paoli, Taccheo-Barbina, et al., 199125. m/0.32 mm/0.10 μm, 160. C @ 1. min, 1.5 K/min; Tend: 240. C
CapillaryOV-11999.de Paoli, Taccheo-Barbina, et al., 199125. m/0.32 mm/0.10 μm, 160. C @ 1. min, 2. K/min; Tend: 240. C
CapillaryOV-12003.de Paoli, Taccheo-Barbina, et al., 199125. m/0.32 mm/0.10 μm, 160. C @ 1. min, 2. K/min; Tend: 240. C

Normal alkane RI, non-polar column, custom temperature program

View large format table.

Column type Active phase I Reference Comment
Capillary5 % Phenyl methyl siloxane2080.Department of Food Safety and Welfare, 200630. m/0.25 mm/0.25 μm, Helium; Program: 50 0C(1 min) 25 0C/min -> 125 0C 10 0C/min -> 300 0C (10 min)
Capillary5 % Phenyl methyl siloxane2072.Department of Food Safety and Welfare, 200630. m/0.25 mm/0.25 μm, Helium; Program: 50 0C(1 min) 25 0C/min -> 125 0C 10 0C/min -> 300 0C (10 min)
OtherMethyl Silicone2015.Ardrey and Moffat, 1981Program: not specified

Normal alkane RI, polar column, custom temperature program

View large format table.

Column type Active phase I Reference Comment
CapillaryCarbowax 20M2805.Tameo and Kiyos, 1991Program: not specified

References

Dubsky, Hána, et al., 1979
Dubsky, H.; Hána, K.; Komárková, M.; Rittich, B., Stanoveni residui chlórovanych pesticidu plynovou chromatografii, Vet. Med. (Prague), 1979, 24, 3, 493-498. [all data]

Ramsey, Lee, et al., 1980
Ramsey, J.D.; Lee, T.D.; Osselton, M.D.; Moffat, A.C., Gas-liquid chromatographic retention indices of 296 non-drug substances on SE-30 or OV-1 likely to be encountered in toxicological analyses, J. Chromatogr., 1980, 184, 2, 185-206, https://doi.org/10.1016/S0021-9673(00)85641-1 . [all data]

de Paoli, Taccheo-Barbina, et al., 1991
de Paoli, M.; Taccheo-Barbina, M.; Bontempelli, G., Gas chromatographic system for the identification of halogenated pesticides by retention indices using n-alkanes as standards, J. Chromatogr., 1991, 547, 355-365, https://doi.org/10.1016/S0021-9673(01)88659-3 . [all data]

Department of Food Safety and Welfare, 2006
Department of Food Safety, Ministry of Health; Welfare, Analytical methods for residual compositional substances of agricultural chemicals, feed aadditives, and veterinary drugs in foods, 2006, retrieved from http://www.mhlw.go.jp/english/topics/foodsafety/positivelist060228/de/060526-1a.pdf. [all data]

Ardrey and Moffat, 1981
Ardrey, R.E.; Moffat, A.C., Gas-liquid chromatographic retention indices of 1318 substances of toxicological interest on SE-30 or OV-1 stationary phase, J. Chromatogr., 1981, 220, 3, 195-252, https://doi.org/10.1016/S0021-9673(00)81925-1 . [all data]

Tameo and Kiyos, 1991
Tameo, O.; Kiyos, I., Simultaneous determination of pesticides by capillary gas chromatography, Cannot be traslated (in Japan), 1991, 14, 2, 109-122. [all data]