Phenazepam

Normal alkane RI, non-polar column, custom temperature program

View large format table.

Column type Active phase I Reference Comment
CapillaryHP-12270.Grigor'ev, Bozhko, et al., 2009Helium; Program: not specified

References

Grigor'ev, Bozhko, et al., 2009
Grigor'ev, A.M.; Bozhko, E.S.; Rudakova, L.V., Use of correlation between retention indices on low-polarity phases for screening comp-lex mixtures by gas chromatography-mass spectrometry, Rus. J. Anal. Chem., 2009, 64, 2, 140-143, https://doi.org/10.1134/S1061934809020087 . [all data]