2-Butynenitrile, 4,4,4-trifluoro-

Gas phase ion energetics data

Data compiled by: Sharon G. Lias, Rhoda D. Levin, and Sherif A. Kafafi

Ionization energy determinations

IE (eV) Method Reference Comment
12.00PEAsbrink, Svensson, et al., 1981
12.00 ± 0.02PEBieri, Heilbronner, et al., 1979
12.26PEAsbrink, Svensson, et al., 1981Vertical value

References

Asbrink, Svensson, et al., 1981
Asbrink, L.; Svensson, A.; Von Niessen, W.; Bieri, G., 30.4 nm He(II) photoelectron spectra of organic molecules, J. Electron Spectrosc. Relat. Phenom., 1981, 24, 293. [all data]

Bieri, Heilbronner, et al., 1979
Bieri, G.; Heilbronner, E.; Hornung, V.; Kloster-Jensen, E.; Maier, J.P.; Thommen, F.; von Niessen, W., Electronic states of substituted haloacetylene and cyanoacetylene radical cations, Chem. Phys., 1979, 36, 1. [all data]