3-Pyridinol-1-oxide

Phase change data

Data compiled by: William E. Acree, Jr., James S. Chickos

Quantity Value Units Method Reference Comment
Δsub121.8 ± 4.4kJ/molMERibeiro da Silva, 1998Based on data from 345. - 392. K.

Gas phase ion energetics data

Data compiled as indicated in comments:
LLK - Sharon G. Lias, Rhoda D. Levin, and Sherif A. Kafafi

Ionization energy determinations

IE (eV) Method Reference Comment
8.60 ± 0.05EIGronneberg, Hurum, et al., 1974LLK

References

Ribeiro da Silva, 1998
Ribeiro da Silva, M., Enthalpies of combustion of the pyridine N-oxide derivatives: 4-methyl-, 3-cyano-, 4-cyano-, 3-hydroxy-, 2-carboxy-, 4-carboxy-, and 3-methyl-4-nitro, and of the pyridine derivatives: 2-carboxy-, and 4-carboxy-. The dissociation enthalpies of the N-O bonds, The Journal of Chemical Thermodynamics, 1998, 30, 7, 869-878, https://doi.org/10.1006/jcht.1998.0353 . [all data]