H2B=NHCH3

Vibrational and/or electronic energy levels

Data compiled by: Marilyn E. Jacox

State:   X

Vib.
sym.
 No.   Approximate
 type of mode
 cm-1   Med.   Method   References

NH stretch 3447 Ar IR Carpenter and Ault, 1991
CH3 stretch 2960 Ar IR Carpenter and Ault, 1991
CH3 stretch 2939 Ar IR Carpenter and Ault, 1991
CH3 stretch 2887 Ar IR Carpenter and Ault, 1991
BH2 a-stretch 2561 Ar IR Carpenter and Ault, 1991
BH2 s-stretch 2471 Ar IR Carpenter and Ault, 1991
1521 Ar IR Carpenter and Ault, 1991
1511 Ar IR Carpenter and Ault, 1991
CH3 deform. 1458 Ar IR Carpenter and Ault, 1991
CH3 deform. 1424 Ar IR Carpenter and Ault, 1991
B=N stretch 1314 Ar IR Carpenter and Ault, 1991
BH2 s-bend 1155 Ar IR Carpenter and Ault, 1991
BH2 OPLA 984 Ar IR Carpenter and Ault, 1991

Additional references: Jacox, 1994, page 398

References

Carpenter and Ault, 1991
Carpenter, J.D.; Ault, B.S., Infrared matrix isolation characterization of aminoborane and related compounds, J. Phys. Chem., 1991, 95, 9, 3502, https://doi.org/10.1021/j100162a013 . [all data]

Jacox, 1994
Jacox, M.E., Vibrational and electronic energy levels of polyatomic transient molecules, American Chemical Society, Washington, DC, 1994, 464. [all data]