3-Methyloctacosane

Van Den Dool and Kratz RI, non-polar column, custom temperature program

View large format table.

Column type Active phase I Reference Comment
CapillaryHP-5MS2871.9Andriamaharavo, 201430. m/0.25 mm/0.25 μm, He; Program: 60C (1 min) => 5 C/min => 210C => 10 C/min => 280C (15 min)

Normal alkane RI, non-polar column, temperature ramp

View large format table.

Column type Active phase I Reference Comment
CapillaryOV-12876.4Krkosova, Kubinec, et al., 2007100. m/0.32 mm/0.25 μm, Helium, 5. K/min, 310. C @ 5. min; Tstart: 30. C
CapillaryBP-12872.Lockey and Oraha, 199012. m/0.22 mm/0.25 μm, Helium, 2. K/min; Tstart: 100. C; Tend: 300. C
CapillaryBP-12869.Lockey and Dularay, 198625. m/0.25 mm/0.25 μm, Helium, 1.5 K/min; Tstart: 160. C; Tend: 300. C
CapillaryBP-12872.Lockey and Dularay, 198625. m/0.25 mm/0.25 μm, Helium, 1.5 K/min; Tstart: 160. C; Tend: 300. C
CapillaryDexsil 3002875.Lockey, 19782. K/min; Column length: 15. m; Tstart: 240. C; Tend: 330. C
CapillaryDexsil 3002875.Lockey, 19782. K/min; Column length: 15. m; Tstart: 240. C; Tend: 330. C

Normal alkane RI, non-polar column, custom temperature program

View large format table.

Column type Active phase I Reference Comment
CapillaryDB-12875.Carlson, Geden, et al., 199930. m/0.32 mm/0.25 μm, He; Program: 60C (2min) => 10C/min => 220C => 3C/min => 310C (12 - 42 min)
CapillaryDexsil 3002881.Lockey, 1981Column length: 15. m; Program: 50 0C 5 0C/min -> 200 0C 2 0C/min -> 340 0C

References

Andriamaharavo, 2014
Andriamaharavo, N.R., Retention Data. NIST Mass Spectrometry Data Center., NIST Mass Spectrometry Data Center, 2014. [all data]

Krkosova, Kubinec, et al., 2007
Krkosova, Z.; Kubinec, R.; Addova, G.; Jurdakova, H.; Blasko, J.; Ostrovsky, I.; Sojak, L., Gas chromatographic - mass spectrometric characterization of monomethylalkanes from fuel diesel, Petroleum Coal, 2007, 49, 3, 51-62. [all data]

Lockey and Oraha, 1990
Lockey, K.H.; Oraha, V.S., Cuticular lipids of adult Locusta Migratoria Migratoriodes (R and F), Schstocerca Gregaria (Forskal) (Acrididae) and other orthopteran species - II. Hydrocarbons, Comp. Biochem. Physiol., 1990, 95B, 4, 721-744. [all data]

Lockey and Dularay, 1986
Lockey, K.H.; Dularay, B., Cuticular methylalkanes of adult cockroaches, Blatta orientalis and Periplaneta Americana, Comp. Biochem. Physiol., 1986, 85B, 3, 567-572. [all data]

Lockey, 1978
Lockey, K.H., Hydrocarbons of adult Tribolum castaneum Hbst. and Tribolium confusum duv. (Coleoptera: Tenebrionidae), Comparative Biochem. Physiol., 1978, 61B, 401-407. [all data]

Carlson, Geden, et al., 1999
Carlson, D.A.; Geden, C.J.; Bernier, U.R., Identification of pupal exiviae of Nasania vitripennis and Muscidifurax raptorellus parasitoids using cuticular hydrocarbons, Biol. Control, 1999, 15, 2, 97-106, https://doi.org/10.1006/bcon.1999.0708 . [all data]

Lockey, 1981
Lockey, K.H., Cuticular hydrocarbons of adult Cylindrinotus laevioctostriatus (Goeze) and Phylan gibbus (Fabricius) (Coleoptera: Tenebrionidae), Insect. Biochem., 1981, 11, 5, 549-561, https://doi.org/10.1016/0020-1790(81)90023-8 . [all data]