2H-Pyran, tetrahydro-2-methoxy-
- Formula: C6H12O2
- Molecular weight: 116.1583
- IUPAC Standard InChIKey: XTDKZSUYCXHXJM-UHFFFAOYSA-N
- CAS Registry Number: 6581-66-4
- Chemical structure:

Gas phase thermochemistry data

Data compiled by: Glushko Thermocenter, Russian Academy of Sciences, Moscow
Quantity | Value | Units | Method | Reference | Comment |
---|---|---|---|---|---|
S°gas | 87.811 | cal/mol*K | N/A | Wiberg K.B., 1989 | Selected values were obtained by ab initio calculation. |
Constant pressure heat capacity of gas
Cp,gas (cal/mol*K) | Temperature (K) | Reference | Comment |
---|---|---|---|
33.659 | 298.15 | Wiberg K.B., 1989 | Selected values were obtained by ab initio calculation. |

References

Wiberg K.B., 1989
Wiberg K.B.,
Rotational barriers. 4. Dimethoxymethane. The anomeric effect revisited.,
J. Am. Chem. Soc., 1989, 111, 4821-4828. [all data]