Phosphine, (fluoromethylidyne)-

Gas phase ion energetics data

Data compiled by: Sharon G. Lias, Rhoda D. Levin, and Sherif A. Kafafi

Ionization energy determinations

IE (eV) Method Reference
10.57 ± 0.01PEKroto, Nixon, et al., 1978

References

Kroto, Nixon, et al., 1978
Kroto, H.W.; Nixon, J.F.; Simmons, N.P.C.; Westwood, N.P.C., FC≡P, C-fluorophosphaethyne: Preparation and detection by photoelectron and microwave spectroscopy, J. Am. Chem. Soc., 1978, 100, 446. [all data]