4-Hydroxy-5-methyl-1H-pyrrole-3-carboxylic acid ethyl ester

Condensed phase thermochemistry data

Data compiled by: Hussein Y. Afeefy, Joel F. Liebman, and Stephen E. Stein

Quantity Value Units Method Reference Comment
Δcsolid-981.9 ± 1.0kcal/molCcbStern and Klebs, 1933Reanalyzed by Cox and Pilcher, 1970, Original value = -984.2 kcal/mol; Heat of combustion at 288 K

References

Stern and Klebs, 1933
Stern, A.; Klebs, G., Calorimetrische bestimmungen bei mehrkernigen pyrrolderivaten. IV. 1. Experimentelle daten fur einige porphyrine, chlorine, phaophorbide and purpurine, Ann. Chim., 1933, 505, 295-306. [all data]

Cox and Pilcher, 1970
Cox, J.D.; Pilcher, G., Thermochemistry of Organic and Organometallic Compounds, Academic Press, New York, 1970, 1-636. [all data]