Molybdenum fluoride

Gas phase thermochemistry data

Quantity Value Units Method Reference Comment
Δfgas-644.802kcal/molReviewChase, 1998Data last reviewed in March, 1979
Quantity Value Units Method Reference Comment
gas,1 bar126.94cal/mol*KReviewChase, 1998Data last reviewed in March, 1979

Gas Phase Heat Capacity (Shomate Equation)

Cp° = A + B*t + C*t2 + D*t3 + E/t2
H° − H°298.15= A*t + B*t2/2 + C*t3/3 + D*t4/4 − E/t + F − H
S° = A*ln(t) + B*t + C*t2/2 + D*t3/3 − E/(2*t2) + G
    Cp = heat capacity (cal/mol*K)
    H° = standard enthalpy (kcal/mol)
    S° = standard entropy (cal/mol*K)
    t = temperature (K) / 1000.

View plot Requires a JavaScript / HTML 5 canvas capable browser.

View table.

Temperature (K) 298. - 6000.
A 64.32651
B 2.734162
C -0.736439
D 0.062609
E -1.316961
F -668.5100
G 196.5910
H -644.8009
ReferenceChase, 1998
Comment Data last reviewed in March, 1979

References

Chase, 1998
Chase, M.W., Jr., NIST-JANAF Themochemical Tables, Fourth Edition, J. Phys. Chem. Ref. Data, Monograph 9, 1998, 1-1951. [all data]