2-methyl-3-(methyldithio)furan

Van Den Dool and Kratz RI, polar column, temperature ramp

Data compiled by: NIST Mass Spectrometry Data Center, William E. Wallace, director

Column type CapillaryCapillaryCapillaryCapillaryCapillary
Active phase DB-FFAPCP-Wax 52CBCP-Wax 52CBCP-Wax 52CBCP-Wax 52CB
Column length (m) 30.50.50.50.50.
Carrier gas He
Substrate
Column diameter (mm) 0.320.320.320.320.32
Phase thickness (μm) 0.24
Tstart (C) 40.60.60.60.60.
Tend (C) 240.220.220.220.220.
Heat rate (K/min) 6.4.4.4.4.
Initial hold (min) 2.5.5.5.5.
Final hold (min) 10.30.30.30.30.
I 1651.1654.1669.1667.1666.
ReferenceScheidig, Czerny, et al., 2007Mahadevan and Farmer, 2006Mahadevan and Farmer, 2006Mahadevan and Farmer, 2006Chevance and Farmer, 1999
Comment MSDC-RI MSDC-RI MSDC-RI MSDC-RI MSDC-RI
Column type CapillaryCapillary
Active phase CP-Wax 52CBDB-Wax
Column length (m) 50.60.
Carrier gas  He
Substrate
Column diameter (mm) 0.320.25
Phase thickness (μm)  0.25
Tstart (C) 40.35.
Tend (C) 220.210.
Heat rate (K/min) 4.2.
Initial hold (min) 5.5.
Final hold (min) 30.30.
I 1663.1667.
ReferenceChevance and Farmer, 1999, 2Ruther and Baltes, 1994
Comment MSDC-RI MSDC-RI

Van Den Dool and Kratz RI, non-polar column, temperature ramp

Data compiled by: NIST Mass Spectrometry Data Center, William E. Wallace, director

Column type CapillaryCapillaryCapillaryCapillaryCapillary
Active phase DB-1DB-1DB-5CP Sil 8 CBCP Sil 8 CB
Column length (m) 20.20.30.50.5.
Carrier gas   He
Substrate
Column diameter (mm) 0.180.180.320.320.32
Phase thickness (μm) 0.180.180.24
Tstart (C) 60.60.40.60.60.
Tend (C) 220.220.240.220.220.
Heat rate (K/min) 8.8.6.4.4.
Initial hold (min) 3.3.2.5.5.
Final hold (min) 5.5.10.30.30.
I 1147.1153.1169.1168.1172.
ReferenceRochat S., de Saint Laumer J.Y., et al., 2007Rochat S., de Saint Laumer J.Y., et al., 2007Scheidig, Czerny, et al., 2007Mahadevan and Farmer, 2006Aliani and Farmer, 2005
Comment MSDC-RI MSDC-RI MSDC-RI MSDC-RI MSDC-RI
Column type CapillaryCapillary
Active phase DB-5DB-5MS
Column length (m) 60.60.
Carrier gas HeHe
Substrate
Column diameter (mm) 0.250.25
Phase thickness (μm) 0.250.25
Tstart (C) 40.40.
Tend (C) 275.200.
Heat rate (K/min) 7.3.
Initial hold (min)  5.
Final hold (min)  60.
I 1178.1169.
ReferenceDreher, Rouseff, et al., 2003Baek, Kim, et al., 2001
Comment MSDC-RI MSDC-RI

Van Den Dool and Kratz RI, non-polar column, custom temperature program

Data compiled by: NIST Mass Spectrometry Data Center, William E. Wallace, director

Column type CapillaryCapillary
Active phase SE-54SE-54
Column length (m) 25.25.
Carrier gas HeHe
Substrate
Column diameter (mm) 0.320.32
Phase thickness (μm) 0.250.5
Program 40C(1min) => 40C/min => 60C(1min) => 4C/min => 140C => 20C/min => 240C(5min)35C (2min) => 4C/min => 150C => 10C/min => 240C
I 1165.1170.
ReferenceFrauendorfer and Schieberle, 2006Fickert and Schieberle, 1998
Comment MSDC-RI MSDC-RI

References

Scheidig, Czerny, et al., 2007
Scheidig, C.; Czerny, M.; Schieberle, P., Changes in Key Odorants of Raw Coffee Beans during Storage under Defined Conditions, J. Agric. Food Chem., 2007, 55, 14, 5768-5775, https://doi.org/10.1021/jf070488o . [all data]

Mahadevan and Farmer, 2006
Mahadevan, K.; Farmer, L., Key Odor Impact Compounds in Three Yeast Extract Pastes, J. Agric. Food Chem., 2006, 54, 19, 7242-7250, https://doi.org/10.1021/jf061102x . [all data]

Chevance and Farmer, 1999
Chevance, F.F.V.; Farmer, L.J., Identification of major volatile odor compounds in frankfurters, J. Agric. Food Chem., 1999, 47, 12, 5151-5160, https://doi.org/10.1021/jf990515d . [all data]

Chevance and Farmer, 1999, 2
Chevance, F.F.V.; Farmer, L.J., Release of volatile odor compounds from full-fat and reduced-fat frankfurters, J. Agric. Food Chem., 1999, 47, 12, 5161-5168, https://doi.org/10.1021/jf9905166 . [all data]

Ruther and Baltes, 1994
Ruther, J.; Baltes, W., Sulfur-containing furans in commercial meat flavorings, J. Agric. Food Chem., 1994, 42, 10, 2254-2259, https://doi.org/10.1021/jf00046a032 . [all data]