Salicylamide

Kovats' RI, non-polar column, isothermal

View large format table.

Column type Active phase Temperature (C) I Reference Comment
CapillaryBP-1130.1402.Japp, Gill, et al., 198725. m/0.22 mm/0.25 μm, N2
CapillaryDB-1130.1397.Japp, Gill, et al., 198730. m/0.53 mm/1.5 μm, N2
CapillaryBP-1130.1422.Japp, Gill, et al., 198725. m/0.53 mm/1. μm, N2
PackedOV-1200.1450.Berninger and Möller, 1977
PackedOV-101200.1445.Möller, 1976N2, Chromosorb G AW DMCS (80-100 mesh); Column length: 2. m
PackedOV-101200.1450.Möller, 1976N2, Chromosorb G AW DMCS (80-100 mesh); Column length: 2. m
PackedOV-101200.1450.Möller, 1976N2, Chromosorb G AW DMCS (80-100 mesh); Column length: 2. m
PackedOV-101200.1460.Möller, 1976N2, Chromosorb G AW DMCS (80-100 mesh); Column length: 2. m

Kovats' RI, non-polar column, custom temperature program

View large format table.

Column type Active phase I Reference Comment
PackedOV-1011470.McLinden and Stenhouse, 1979N2, Chromosorb W; Column length: 2. m; Program: not specified
PackedOV-11450.Berninger, Grunnagel, et al., 1975N2, Chromosorb G, AW-DMCS; Column length: 2. m; Program: not specified
PackedOV-11450.Berninger, Grunnagel, et al., 1975N2, Chromosorb G, AW-DMCS; Column length: 2. m; Program: not specified

Van Den Dool and Kratz RI, non-polar column, temperature ramp

View large format table.

Column type Active phase I Reference Comment
CapillaryDB-11405.Perrigo, Peel, et al., 198515. m/0.32 mm/0.25 μm, He, 8. K/min, 280. C @ 5. min; Tstart: 120. C
CapillaryDB-11405.Perrigo, Ballantyne, et al., 198415. m/0.25 mm/0.25 μm, He, 8. K/min, 280. C @ 5. min; Tstart: 120. C
PackedSE-301435.Perrigo and Peel, 1981N2, Chromosorb W, 130. C @ 2. min, 8. K/min, 290. C @ 8. min; Column length: 1.8 m

Normal alkane RI, non-polar column, temperature ramp

View large format table.

Column type Active phase I Reference Comment
CapillaryDB-11399.Anderson and Fuller, 198710. m/0.53 mm/2.65 μm, He, 5. K/min; Tstart: 130. C; Tend: 230. C
CapillaryDB-11409.Sharp, 198715. m/0.25 mm/0.25 μm, He, 130. C @ 1. min, 10. K/min, 290. C @ 10. min
PackedSE-301435.Peel and Perrigo, 1976Nitrogen, Chromosorb W AW DMS (80-100 mesh), 130. C @ 2. min, 8. K/min, 290. C @ 8. min; Column length: 2. m
PackedSE-301435.Peel and Perrigo, 1975N2, Chromosorb W AW DMS, 130. C @ 2. min, 8. K/min, 290. C @ 8. min; Column length: 2. m

Normal alkane RI, non-polar column, custom temperature program

View large format table.

Column type Active phase I Reference Comment
OtherMethyl Silicone1455.Ardrey and Moffat, 1981Program: not specified

Phase change data

Data compiled as indicated in comments:
TRC - Thermodynamics Research Center, NIST Boulder Laboratories, Chris Muzny director
AC - William E. Acree, Jr., James S. Chickos

Quantity Value Units Method Reference Comment
Tfus414.KN/AGrady, Hays, et al., 1973Uncertainty assigned by TRC = 1. K; TRC
Quantity Value Units Method Reference Comment
Δsub101.9 ± 0.4kJ/molCBernardes and Minas da Piedade, 2008AC
Δsub99.3 ± 1.3kJ/molCRibeiro da Silva and Araújo, 2007AC

Enthalpy of fusion

ΔfusH (kJ/mol) Temperature (K) Method Reference Comment
27.1414.9DSCBernardes and Minas da Piedade, 2008AC
29.0411.9N/ANordström and Rasmuson, 2006AC

In addition to the Thermodynamics Research Center (TRC) data available from this site, much more physical and chemical property data is available from the following TRC products:

References

Japp, Gill, et al., 1987
Japp, M.; Gill, R.; Osselton, M.D., Comparison of drug retention indices determined on packed, wide bore capillary and narrow bore capillary columns, J. Forensic Sci., 1987, 32, 6, 1574-1586. [all data]

Berninger and Möller, 1977
Berninger, H.; Möller, M.R., Retentionsindices zur gaschromatographischen Identifizierung von Arzneimitteln, Arch. Toxicol., 1977, 37, 4, 295-305, https://doi.org/10.1007/BF00330821 . [all data]

Möller, 1976
Möller, M.R., Comparability of retention indices of polar substances at elevated temperatures, Chromatographia, 1976, 9, 7, 311-314, https://doi.org/10.1007/BF02268832 . [all data]

McLinden and Stenhouse, 1979
McLinden, V.J.; Stenhouse, A.M., A chromatography system for drug identification, Forensic Sci. Int., 1979, 13, 71-79, https://doi.org/10.1016/0379-0738(79)90265-2 . [all data]

Berninger, Grunnagel, et al., 1975
Berninger, H.; Grunnagel, R.; Mall, S.; Moller, M.R., Gas chromatographic identification of unknown substances from body fluids by menas of retention indices, Beitr. Gerichtl. Med., 1975, 33, 185-191. [all data]

Perrigo, Peel, et al., 1985
Perrigo, B.J.; Peel, H.W.; Ballantyne, D.J., Use of Dual-Column Fused-Silica Capillary Gas Chromatography in Combination with Detector Response Factors for Analytical Toxicology., J. Chromatogr., 1985, 341, 81-88, https://doi.org/10.1016/S0378-4347(00)84011-6 . [all data]

Perrigo, Ballantyne, et al., 1984
Perrigo, B.J.; Ballantyne, D.J.; Peel, H.W., Condierations in developing a data base for drugs on a DBI capillary column, J. Can. Soc. Forensic Sci., 1984, 17, 2, 41-49, https://doi.org/10.1080/00085030.1984.10757360 . [all data]

Perrigo and Peel, 1981
Perrigo, B.J.; Peel, H.W., The use of retention indices and temperature-programmed gas chromatography in analytical toxicology, J. Chromatogr. Sci., 1981, 19, 5, 219-226, https://doi.org/10.1093/chromsci/19.5.219 . [all data]

Anderson and Fuller, 1987
Anderson, W.H.; Fuller, D.C., A simplified procedure for the isolation, characterization, and identification of weak acid and neutral drugs from whole blood, J. Anal. Toxicol., 1987, 11, 5, 198-204, https://doi.org/10.1093/jat/11.5.198 . [all data]

Sharp, 1987
Sharp, M.E., A rapid screening procedure for acidic and neutral drugs in blood by high resolution gas chromatography, J. Anal. Toxicol., 1987, 11, 1, 8-11, https://doi.org/10.1093/jat/11.1.8 . [all data]

Peel and Perrigo, 1976
Peel, H.W.; Perrigo, B., A practical gas chromatographic screening procedure for toxicological analysis, Can. Soc. Forens. Sci. J., 1976, 9, 2, 69-74, https://doi.org/10.1080/00085030.1976.10757247 . [all data]

Peel and Perrigo, 1975
Peel, H.W.; Perrigo, B., A practical gas chromatographic screening procedure for toxicological analysis, Can.Soc.Forens.Sci.J., 1975, 9, 2, 69-74, https://doi.org/10.1080/00085030.1976.10757247 . [all data]

Ardrey and Moffat, 1981
Ardrey, R.E.; Moffat, A.C., Gas-liquid chromatographic retention indices of 1318 substances of toxicological interest on SE-30 or OV-1 stationary phase, J. Chromatogr., 1981, 220, 3, 195-252, https://doi.org/10.1016/S0021-9673(00)81925-1 . [all data]