Vitispirane

Van Den Dool and Kratz RI, polar column, temperature ramp

Data compiled by: NIST Mass Spectrometry Data Center, William E. Wallace, director

Column type Capillary
Active phase DB-Wax
Column length (m) 30.
Carrier gas He
Substrate
Column diameter (mm) 0.25
Phase thickness (μm) 0.25
Tstart (C) 50.
Tend (C) 220.
Heat rate (K/min) 4.
Initial hold (min) 3.
Final hold (min) 20.
I 1515.
ReferenceHumpf and Schreier, 1991
Comment MSDC-RI

Kovats' RI, non-polar column, temperature ramp

View large format table.

Column type Active phase I Reference Comment
CapillaryHP-51279.Nickavar, Salehi-Sormagi, et al., 200230. m/0.25 mm/0.25 μm, He, 4. K/min; Tstart: 60. C; Tend: 275. C

Kovats' RI, non-polar column, custom temperature program

View large format table.

Column type Active phase I Reference Comment
CapillarySPB-11260.Riu-Aumatell, Castellari, et al., 200430. m/0.25 mm/0.25 μm; Program: not specified

Kovats' RI, polar column, temperature ramp

View large format table.

Column type Active phase I Reference Comment
CapillarySupelcowax1505.Riu-Aumatell, Castellari, et al., 200430. m/0.25 mm/0.25 μm, 60. C @ 5. min, 3. K/min, 240. C @ 10. min

Van Den Dool and Kratz RI, non-polar column, temperature ramp

View large format table.

Column type Active phase I Reference Comment
CapillarySPB-51272.Pino, Marbot, et al., 200430. m/0.25 mm/0.25 μm, He, 60. C @ 2. min, 4. K/min, 250. C @ 20. min
CapillarySPB-51272.Pino, Marbot, et al., 200330. m/0.25 mm/0.25 μm, He, 60. C @ 2. min, 4. K/min, 250. C @ 20. min
CapillaryCP Sil 5 CB1268.Pino, Marbot, et al., 200250. m/0.32 mm/0.4 μm, He, 60. C @ 10. min, 3. K/min, 280. C @ 60. min

Van Den Dool and Kratz RI, non-polar column, custom temperature program

View large format table.

Column type Active phase I Reference Comment
CapillaryHP-11276.Sing, Smadja, et al., 199250. m/0.32 mm/1.05 μm, He; Program: 20C(0.5min) => 60C => 4C/min => 250C

Normal alkane RI, non-polar column, temperature ramp

View large format table.

Column type Active phase I Reference Comment
CapillaryHP-5MS1271.Ferhat, Tigrine-Kordjani, et al., 200730. m/0.25 mm/0.25 μm, He, 60. C @ 8. min, 2. K/min, 250. C @ 15. min
CapillaryHP-5 MS1271.Tigrine-Kordiani, Meklati, et al., 200630. m/0.25 mm/0.25 μm, Helium, 60. C @ 8. min, 2. K/min, 250. C @ 15. min
CapillaryHP-51242.0Leffingwell and Alford, 200560. m/0.32 mm/0.25 μm, He, 30. C @ 2. min, 2. K/min, 260. C @ 28. min
CapillaryOptima-11270.de Beck, Bessière, et al., 200025. m/0.20 mm/0.25 μm, He, 50. C @ 3. min, 3. K/min; Tend: 250. C
CapillaryBP-51315.Lopez, Ferreira, et al., 199950. m/0.32 mm/1. μm, He, 40. C @ 5. min, 2. K/min; Tend: 190. C
CapillaryDB-51286.Georgilopoulos and Gallois, 198830. m/0.35 mm/1.0 μm, Hydrogen, 2. K/min; Tstart: 45. C; Tend: 220. C

Normal alkane RI, non-polar column, custom temperature program

View large format table.

Column type Active phase I Reference Comment
CapillaryPolydimethyl siloxane with 5 % Ph groups1272.Robinson, Adams, et al., 2012Program: not specified
CapillaryPolydimethyl siloxane with 5 % Ph groups1292.Robinson, Adams, et al., 2012Program: not specified
CapillarySPB-11260.Riu-Aumatell, Bosch-Fuste´, et al., 200630. m/0.25 mm/0.25 μm; Program: not specified
CapillaryHP-51281.Demyttenaere, Dagher, et al., 200330. m/0.25 mm/0.25 μm, He; Program: 40C(1min) => 5C/min => 180C => 10C/min => 220C(2min)
CapillaryHP-5MS1281.Demyttenaere, Dagher, et al., 200230. m/0.25 mm/0.25 μm, He; Program: 40C(1min) => 5C/min => 220C => 10C/min => 240C(2min)

Normal alkane RI, polar column, temperature ramp

View large format table.

Column type Active phase I Reference Comment
CapillaryDB-Wax1524.Zhao, Xu, et al., 200930. m/0.25 mm/0.25 μm, Helium, 40. C @ 2. min, 3. K/min, 230. C @ 5. min
CapillaryDB-Wax1528.Zhao, Xu, et al., 200930. m/0.25 mm/0.25 μm, Helium, 40. C @ 2. min, 3. K/min, 230. C @ 5. min
CapillaryCarbowax1513.Ferhat, Tigrine-Kordjani, et al., 200760. m/0.2 mm/0.25 μm, He, 60. C @ 8. min, 2. K/min, 250. C @ 15. min
CapillaryCarbowax-PEG1513.Tigrine-Kordiani, Meklati, et al., 200660. m/0.20 mm/0.25 μm, Helium, 60. C @ 8. min, 2. K/min, 250. C @ 15. min
CapillaryDB-Wax1527.López, Ezpeleta, et al., 200460. m/0.25 mm/0.25 μm, He, 40. C @ 5. min, 3. K/min; Tend: 220. C
CapillaryCarbowax 20M1543.Lopez, Ferreira, et al., 199960. m/0.32 mm/0.5 μm, He, 40. C @ 5. min, 2. K/min; Tend: 190. C
CapillaryCarbowax 20M1515.Kawakami and Kobayashi, 1991He, 60. C @ 4. min, 2. K/min; Column length: 50. m; Column diameter: 0.25 mm; Tend: 180. C

Normal alkane RI, polar column, custom temperature program

View large format table.

Column type Active phase I Reference Comment
CapillaryDB-Wax1507.Zhao, Xu, et al., 200930. m/0.25 mm/0.25 μm, Helium; Program: not specified
CapillaryDB-Wax1510.Zhao, Xu, et al., 200930. m/0.25 mm/0.25 μm, Helium; Program: not specified
CapillarySupelcowax-101507.Riu-Aumatell, Bosch-Fuste´, et al., 200630. m/0.25 mm/0.25 μm; Program: not specified
CapillaryCarbowax 20M1535.Vinogradov, 2004Program: not specified

References

Humpf and Schreier, 1991
Humpf, H.-U.; Schreier, P., Bound aroma compounds from the fruit and the leaves of blackberry (Rubus laciniata L.), J. Agric. Food Chem., 1991, 39, 10, 1830-1832, https://doi.org/10.1021/jf00010a028 . [all data]