1-Methylcyclopropyl

Gas phase ion energetics data

Data compiled as indicated in comments:
LBLHLM - Sharon G. Lias, John E. Bartmess, Joel F. Liebman, John L. Holmes, Rhoda D. Levin, and W. Gary Mallard
LLK - Sharon G. Lias, Rhoda D. Levin, and Sherif A. Kafafi

Ionization energy determinations

IE (eV) Method Reference Comment
7.49 ± 0.02PESchultz, Houle, et al., 1984LBLHLM
7.54EILossing, 1972LLK
7.67 ± 0.02PESchultz, Houle, et al., 1984Vertical value; LBLHLM

References

Schultz, Houle, et al., 1984
Schultz, J.C.; Houle, F.A.; Beauchamp, J.L., Photoelectron spectroscopy of isomeric C4H7 radicals. Implications for the thermochemistry and structures of the radicals and their corresponding carbonium ions, J. Am. Chem. Soc., 1984, 106, 7336. [all data]

Lossing, 1972
Lossing, F.P., Free radicals by mass spectrometry. XLV. Ionization potentials and heats of formation of C3H3, C3H5, and C4H7 radicals and ions, Can. J. Chem., 1972, 50, 3973. [all data]