piperazine-1,4-diethylamine

Condensed phase thermochemistry data

Data compiled by: Eugene S. Domalski and Elizabeth D. Hearing

Constant pressure heat capacity of liquid

Cp,liquid (J/mol*K) Temperature (K) Reference Comment
407.333.Bobylev, Kamskaya, et al., 1988T = 333 to 473 K.

References

Bobylev, Kamskaya, et al., 1988
Bobylev, V.A.; Kamskaya, O.I.; Kossoi, A.A.; Koludarova, E.Yu., Investigation of the heat capacity of ethyleneamines by differential scanning calorimetry, Zhur. Obshch. Khim., 1988, 58, 2536-2538. [all data]