Trivinylbismuth

Phase change data

Data compiled by: William E. Acree, Jr., James S. Chickos

Enthalpy of vaporization

ΔvapH (kJ/mol) Temperature (K) Reference Comment
48.5308.Maier, Seyferth, et al., 1957Based on data from 293. - 346. K. See also Boublik, Fried, et al., 1984.

References

Maier, Seyferth, et al., 1957
Maier, Ludwig; Seyferth, Dietmar; Stone, F.G.A.; Rochow, Eugene G., Vinyl Derivatives of the Metals. VI. Preparation, Properties and Some Reactions of Trivinyl Compounds of Group V Elements 1,2, J. Am. Chem. Soc., 1957, 79, 22, 5884-5889, https://doi.org/10.1021/ja01579a012 . [all data]

Boublik, Fried, et al., 1984
Boublik, T.; Fried, V.; Hala, E., The Vapour Pressures of Pure Substances: Selected Values of the Temperature Dependence of the Vapour Pressures of Some Pure Substances in the Normal and Low Pressure Region, 2nd ed., Elsevier, New York, 1984, 972. [all data]