1,2-Diazabicyclo[2.2.2]octane, 2-methyl-

Gas phase ion energetics data

Data evaluated as indicated in comments:
HL - Edward P. Hunter and Sharon G. Lias

Data compiled as indicated in comments:
LBLHLM - Sharon G. Lias, John E. Bartmess, Joel F. Liebman, John L. Holmes, Rhoda D. Levin, and W. Gary Mallard
LLK - Sharon G. Lias, Rhoda D. Levin, and Sherif A. Kafafi

Quantity Value Units Method Reference Comment
Proton affinity (review)968.9kJ/molN/AHunter and Lias, 1998HL
Quantity Value Units Method Reference Comment
Gas basicity938.1kJ/molN/AHunter and Lias, 1998HL

Ionization energy determinations

IE (eV) Method Reference Comment
8.28PENelsen, 1984Vertical value; LBLHLM
8.02PENelsen and Buschek, 1974Vertical value; LLK

References

Hunter and Lias, 1998
Hunter, E.P.; Lias, S.G., Evaluated Gas Phase Basicities and Proton Affinities of Molecules: An Update, J. Phys. Chem. Ref. Data, 1998, 27, 3, 413-656, https://doi.org/10.1063/1.556018 . [all data]

Nelsen, 1984
Nelsen, S.F., Ionization from nitrogen and oxygen lone pairs: A comparison of trialkylamine, dialkyl ether, tetraalkylhydrazine, and dialkyl peroxide photoelectron spectroscopic ionization potentials, J. Org. Chem., 1984, 49, 1891. [all data]

Nelsen and Buschek, 1974
Nelsen, S.F.; Buschek, J.M., Photoelectron spectra of hydrazines. V. Pyrazolidine and hexahydropyridazine derivatives, J. Am. Chem. Soc., 1974, 96, 6987. [all data]