4,2,7-Ethanylylidenecyclopenta[b]pyran-9-one, 2,3,4,4a,7,7a-hexahydro-

Condensed phase thermochemistry data

Data compiled by: Hussein Y. Afeefy, Joel F. Liebman, and Stephen E. Stein

Quantity Value Units Method Reference Comment
Δfsolid-57.96 ± 0.36kcal/molCcrSmeaton, Steele, et al., 1983
Quantity Value Units Method Reference Comment
Δcsolid-1224.13 ± 0.29kcal/molCcrSmeaton, Steele, et al., 1983Corresponding Δfsolid = -57.961 kcal/mol (simple calculation by NIST; no Washburn corrections)

Phase change data

Data compiled by: Hussein Y. Afeefy, Joel F. Liebman, and Stephen E. Stein

Quantity Value Units Method Reference Comment
Δsub22.9 ± 0.36kcal/molVSmeaton, Steele, et al., 1983

References

Smeaton, Steele, et al., 1983
Smeaton, A.A.; Steele, W.V.; Ramos Tombo, G.M.; Ganter, C., Nucleophilic addition to C,C-double bonds. Part VIII. The standard enthalpies of formation of anti9,10-10-endo-hydroxytricyclo[4.2.1.12,5] deca-3,7-dien-9-one and 9-oxatetracyclo[5.4.0.03,10.04,8] undec-5-en-2-one and kinetic data for the cyclization of the olefinic alcohol to the ether, Helv. Chim. Acta, 1983, 66, 2449-2453. [all data]