Anti(9,10)-10-endo-hydroxytricyclo[4.2.1.1(2,5)]deca-3,7-dien-9-one

Condensed phase thermochemistry data

Data compiled by: Hussein Y. Afeefy, Joel F. Liebman, and Stephen E. Stein

Quantity Value Units Method Reference Comment
Δfsolid-166.7 ± 3.0kJ/molCcrSmeaton, Steele, et al., 1983
Quantity Value Units Method Reference Comment
Δcsolid-5197.6 ± 3.0kJ/molCcrSmeaton, Steele, et al., 1983Corresponding Δfsolid = -166.7 kJ/mol (simple calculation by NIST; no Washburn corrections)

References

Smeaton, Steele, et al., 1983
Smeaton, A.A.; Steele, W.V.; Ramos Tombo, G.M.; Ganter, C., Nucleophilic addition to C,C-double bonds. Part VIII. The standard enthalpies of formation of anti9,10-10-endo-hydroxytricyclo[4.2.1.12,5] deca-3,7-dien-9-one and 9-oxatetracyclo[5.4.0.03,10.04,8] undec-5-en-2-one and kinetic data for the cyclization of the olefinic alcohol to the ether, Helv. Chim. Acta, 1983, 66, 2449-2453. [all data]