1,4,6-Trimethyl-1,2,3,3a,4,7,8,8a-octahydro-4,7-ethanoazulene

Normal alkane RI, non-polar column, temperature ramp

View large format table.

Column type Active phase I Reference Comment
CapillaryHP-5 MS1460.Feizbakhsh and Naeemy, 201130. m/0.25 mm/0.25 μm, Helium, 60. C @ 20. min, 4. K/min, 220. C @ 20. min
CapillaryCP-Sil 5 CB1468.Olawore, Usman, et al., 200625. m/0.25 mm/0.15 μm, Hydrogen, 3. K/min; Tstart: 50. C; Tend: 230. C

References

Feizbakhsh and Naeemy, 2011
Feizbakhsh, A.; Naeemy, A., Volatile constituents of essential oils of Eleocharis pauciflora (Light) Link and Eleocharis uniglumis (Link) J.A. Schultes growing wild in Iran, Bull. Chem. Soc. Ethiop., 2011, 25, 3, 461-464, https://doi.org/10.4314/bcse.v25i3.68606 . [all data]

Olawore, Usman, et al., 2006
Olawore, N.O.; Usman, L.A.; Ogunwande, I.A.; Adeleke, K.A., Constituents of rhizome essential oils of two types of Cyperus articulatus L. grown in Nigeria, J. Essent Oil Res., 2006, 18, 6, 604-606, https://doi.org/10.1080/10412905.2006.9699179 . [all data]