i-C4H9

Reaction thermochemistry data

Data compiled by: John E. Bartmess

Individual Reactions

(i-C4H9 • 42949672951-Propene, 2-methyl-) + 1-Propene, 2-methyl- = i-C4H9

By formula: (C4H9 • 4294967295C4H8) + C4H8 = C4H9

Quantity Value Units Method Reference Comment
Δr64.0 ± 8.8kJ/molN/ADePuy, Gronert, et al., 1989gas phase

References

DePuy, Gronert, et al., 1989
DePuy, C.H.; Gronert, S.; Barlow, S.E.; Bierbaum, V.M.; Damrauer, R., The Gas Phase Acidities of the Alkanes, J. Am. Chem. Soc., 1989, 111, 6, 1968, https://doi.org/10.1021/ja00188a003 . [all data]