SClF3

Vibrational and/or electronic energy levels

Data compiled by: Marilyn E. Jacox

State:   X

Vib.
sym.
 No.   Approximate
 type of mode
 cm-1   Med.   Method   References

SF eq. stretch 841 w m Ar IR Minkwitz, Nass, et al., 1986
SF ax. a-str. 668 s Ar IR Minkwitz, Nass, et al., 1986
SF ax. s-str. 606 m Ar IR Minkwitz, Nass, et al., 1986
SCl stretch 506 m Ar IR Minkwitz, Nass, et al., 1986

Additional references: Jacox, 1994, page 304

References

Minkwitz, Nass, et al., 1986
Minkwitz, R.; Nass, U.; Sawatzki, J., Beiträge zur chemie der schwefelhalogenide. 10. [1] Matrixisolation von SCl3F, SCl2F2 und SClF3, J. Fluorine Chem., 1986, 31, 2, 175, https://doi.org/10.1016/S0022-1139(00)80532-1 . [all data]

Jacox, 1994
Jacox, M.E., Vibrational and electronic energy levels of polyatomic transient molecules, American Chemical Society, Washington, DC, 1994, 464. [all data]