1,1,2-Trifluoro-2-chloroethyl-2,2,3,3,4,4,5,5,6,6,7,7-dodecafluoroheptyl ether

Gas phase thermochemistry data

Data compiled by: Hussein Y. Afeefy, Joel F. Liebman, and Stephen E. Stein

Quantity Value Units Method Reference Comment
Δfgas-3391.9 ± 2.6kJ/molCcrDityateva and Kolesov, 1979Reanalyzed by Kolesov and Kozina, 1986, Original value = -3352.9 kJ/mol

Condensed phase thermochemistry data

Data compiled by: Hussein Y. Afeefy, Joel F. Liebman, and Stephen E. Stein

Quantity Value Units Method Reference Comment
Δfliquid-3409.0 ± 4.8kJ/molCcrDityateva and Kolesov, 1979
Quantity Value Units Method Reference Comment
Δcliquid-3371.5 ± 4.8kJ/molCcrDityateva and Kolesov, 1979

Phase change data

Data compiled by: Hussein Y. Afeefy, Joel F. Liebman, and Stephen E. Stein

Quantity Value Units Method Reference Comment
Δvap56.1kJ/molCDityateva and Kolesov, 1979

References

Dityateva and Kolesov, 1979
Dityateva, L.N.; Kolesov, V.P., Standard enthalpies of formation of some fluorochloro-substituted ethers, Termodin. Org. Soedin., 1979, 51-54. [all data]

Kolesov and Kozina, 1986
Kolesov, V.P.; Kozina, M.P., Thermochemistry of organic and organohalogen compounds, Russ. Chem. Rev., 1986, 55, 912. [all data]