1,1,2-Trifluoroethyl-2-chloroethyl-2,2,3,3-tetrafluoropropyl ether

Gas phase thermochemistry data

Data compiled by: Hussein Y. Afeefy, Joel F. Liebman, and Stephen E. Stein

Quantity Value Units Method Reference Comment
Δfgas-1720.7 ± 1.2kJ/molCcrDityateva and Kolesov, 1979Reanalyzed by Kolesov and Kozina, 1986, Original value = -1699.6 kJ/mol

Condensed phase thermochemistry data

Data compiled by: Hussein Y. Afeefy, Joel F. Liebman, and Stephen E. Stein

Quantity Value Units Method Reference Comment
Δfliquid-1743.5 ± 2.1kJ/molCcrDityateva and Kolesov, 1979
Quantity Value Units Method Reference Comment
Δcliquid-2053.1 ± 2.1kJ/molCcrDityateva and Kolesov, 1979

Phase change data

Data compiled by: Hussein Y. Afeefy, Joel F. Liebman, and Stephen E. Stein

Quantity Value Units Method Reference Comment
Δvap43.9kJ/molCDityateva and Kolesov, 1979

References

Dityateva and Kolesov, 1979
Dityateva, L.N.; Kolesov, V.P., Standard enthalpies of formation of some fluorochloro-substituted ethers, Termodin. Org. Soedin., 1979, 51-54. [all data]

Kolesov and Kozina, 1986
Kolesov, V.P.; Kozina, M.P., Thermochemistry of organic and organohalogen compounds, Russ. Chem. Rev., 1986, 55, 912. [all data]