2-((2R,4aR,8aR)-4a,8-Dimethyl-1,2,3,4,4a,5,6,8a-octahydronaphthalen-2-yl)prop-2-en-1-ol

Van Den Dool and Kratz RI, non-polar column, custom temperature program

View large format table.

Column type Active phase I Reference Comment
CapillaryHP-5MS1778.4Andriamaharavo, 201430. m/0.25 mm/0.25 μm, He; Program: 60C (1 min) => 5 C/min => 210C => 10 C/min => 280C (15 min)

Normal alkane RI, non-polar column, temperature ramp

View large format table.

Column type Active phase I Reference Comment
CapillaryCP-Sil 5 CB1785.Hnawia, Menut, et al., 200930. m/0.25 mm/0.25 μm, Nitrogen, 5. K/min; Tstart: 50. C; Tend: 200. C
CapillarySE-301729.Prikhod'ko, Klyuev, et al., 199930. m/0.25 mm/0.20 μm, Helium, 60. C @ 4. min, 3. K/min; Tend: 200. C

Normal alkane RI, polar column, custom temperature program

View large format table.

Column type Active phase I Reference Comment
CapillaryInnowax2604.Tunaher, Kirimer, et al., 200360. m/0.25 mm/0.25 μm, He; Program: 60C(10min) => 4C/min => 220C(10min) => 1C/min => 240C (20min)

References

Andriamaharavo, 2014
Andriamaharavo, N.R., Retention Data. NIST Mass Spectrometry Data Center., NIST Mass Spectrometry Data Center, 2014. [all data]

Hnawia, Menut, et al., 2009
Hnawia, E.; Menut, C.; Agrebi, A.; Cabalion, P., Wood essential oil of two endemic trees from New Caledonia: Callitris sulcata (Parl.) Schltr. and Callitris neocaledonica Dummer, Biochem. Systematics Ecol., 2009, 36, 11, 859-866, https://doi.org/10.1016/j.bse.2008.08.007 . [all data]

Prikhod'ko, Klyuev, et al., 1999
Prikhod'ko, A.B.; Klyuev, N.A.; Volkovich, S.V.; Emets, T.I.; Petrenko, V.V.; Dolya, E.V., Component composition od the essential oil of Thymus dimorphus, Chem. Nat. Comp., 1999, 35, 1, 46-51, https://doi.org/10.1007/BF02238208 . [all data]

Tunaher, Kirimer, et al., 2003
Tunaher, Z.; Kirimer, N.; Baser, K.H.C., Wood essential oils of Juniperus foetidissima Willd., Holzforschung, 2003, 57, 140-144. [all data]