Chromium,pentacarbonyl(4-chloropyridine)-

Gas phase ion energetics data

Data compiled by: Sharon G. Lias, Rhoda D. Levin, and Sherif A. Kafafi

Ionization energy determinations

IE (eV) Method Reference Comment
7.42PIWeiner, Gin, et al., 1977Vertical value

References

Weiner, Gin, et al., 1977
Weiner, M.A.; Gin, A.; Lattman, M., Ultraviolet photoelectron spectra of 4-substituted pyridine- pentacarbonylchromium complexes, Inorg. Chim. Acta, 1977, 24, 235. [all data]