CAS Reg. No. 64883-69-8

Reaction thermochemistry data

Data compiled by: John E. Bartmess

Individual Reactions

(CAS Reg. No. 64883-69-8 • 4294967295yttrium) + yttrium = CAS Reg. No. 64883-69-8

By formula: (CAS Reg. No. 64883-69-8 • 4294967295Y) + Y = CAS Reg. No. 64883-69-8

Quantity Value Units Method Reference Comment
Δr698.8 ± 3.5kJ/molN/AWu and Wang, 1998gas phase

References

Wu and Wang, 1998
Wu, H.B.; Wang, L.S., Photoelectron spectroscopy and electronic structure of ScOn- (n = 1-4) and YOn- (n = 1-5): Strong electron correlation effects in ScO- and YO-, J. Phys. Chem. A, 1998, 102, 46, 9129-9135, https://doi.org/10.1021/jp982588q . [all data]