4H-1,2,3-Triazole-4-thione, 2,3-dihydro-2,3-dimethyl-

Gas phase ion energetics data

Data compiled as indicated in comments:
LBLHLM - Sharon G. Lias, John E. Bartmess, Joel F. Liebman, John L. Holmes, Rhoda D. Levin, and W. Gary Mallard
LLK - Sharon G. Lias, Rhoda D. Levin, and Sherif A. Kafafi

Ionization energy determinations

IE (eV) Method Reference Comment
7.4PEGuimon, Pfister-Guillouzo, et al., 1983LBLHLM
8.0PEGuimon, Pfister-Guillouzo, et al., 1983Vertical value; LBLHLM
7.97PEGuimon, Pfister-Guillouzo, et al., 1978Vertical value; LLK

References

Guimon, Pfister-Guillouzo, et al., 1983
Guimon, C.; Pfister-Guillouzo, G.; Begtrup, M., Tautomerism of Pyrazoline-5-thione and Trazoline-5-thione Studied by Variable Temperature Photoelectron Spectroscopy, Can. J. Chem., 1983, 61, 1197. [all data]

Guimon, Pfister-Guillouzo, et al., 1978
Guimon, C.; Pfister-Guillouzo, G.; Begtrup, M., Photoelectron spectra of some pyrazolthiones, 1,2,3-triazolthiones, and 4-(1,2,3-triazolio) sulfides. Evidence of an abnormal effect of methylation, J. Am. Chem. Soc., 1978, 100, 1275. [all data]