1,3-Butadiyne, 1,4-difluoro-

Gas phase ion energetics data

Data compiled by: Sharon G. Lias, Rhoda D. Levin, and Sherif A. Kafafi

Ionization energy determinations

IE (eV) Method Reference Comment
10.05PEBieri, Schmelzer, et al., 1980
10.35PEBieri, Heilbronner, et al., 1977Vertical value

References

Bieri, Schmelzer, et al., 1980
Bieri, G.; Schmelzer, A.; Asbrink, L.; Jonsson, M., Fluorine and the fluoroderivatives of acetylene and diacetylene studied by 30.4 nm He(II) photoelectron spectroscopy, Chem. Phys., 1980, 49, 213. [all data]

Bieri, Heilbronner, et al., 1977
Bieri, G.; Heilbronner, E.; Stadelmann, J.-P.; Vogt, J.; von Niessen, W., Electronic states of difluoroacetylene, difluorodiacetylene, and perfluoropentadiyne-1,3 radical cations. A photoelectron spectroscopic investigation, J. Am. Chem. Soc., 1977, 99, 6832. [all data]