CAS Reg. No. 64724-02-3

Reaction thermochemistry data

Data compiled by: John E. Bartmess

Individual Reactions

(CAS Reg. No. 64724-02-3 • 42949672952-Butenal) + 2-Butenal = CAS Reg. No. 64724-02-3

By formula: (CAS Reg. No. 64724-02-3 • 4294967295C4H6O) + C4H6O = CAS Reg. No. 64724-02-3

Quantity Value Units Method Reference Comment
Δr60.5 ± 2.2kcal/molN/AAlconcel, Deyerl, et al., 2001gas phase
Δr61.1 ± 2.4kcal/molTherZimmerman, Reed, et al., 1977gas phase

References

Alconcel, Deyerl, et al., 2001
Alconcel, L.S.; Deyerl, H.J.; Continetti, R.E., Effects of alkyl substitution on the energetics of enolate anions and radicals, J. Am. Chem. Soc., 2001, 123, 50, 12675-12681, https://doi.org/10.1021/ja0120431 . [all data]

Zimmerman, Reed, et al., 1977
Zimmerman, A.H.; Reed, K.J.; Brauman, J.I., Photodetachment of electrons from enolate anions. Gas phase electron affinities of enolate radicals, J. Am. Chem. Soc., 1977, 99, 7203. [all data]