Nonadecanoic acid

Condensed phase thermochemistry data

Data compiled as indicated in comments:
ALS - Hussein Y. Afeefy, Joel F. Liebman, and Stephen E. Stein
DH - Eugene S. Domalski and Elizabeth D. Hearing

Quantity Value Units Method Reference Comment
Δcliquid-11923.4 ± 2.3kJ/molCcbAdriaanse, Dekker, et al., 1965Reanalyzed by Cox and Pilcher, 1970, Original value = -11922.7 ± 2.3 kJ/mol; Hfusion=67.7 kJ/mol; Corresponding Δfliquid = -984.1 kJ/mol (simple calculation by NIST; no Washburn corrections); ALS

Constant pressure heat capacity of solid

Cp,solid (J/mol*K) Temperature (K) Reference Comment
525.35298.15Schaake, van Miltenburg, et al., 1982T = 80 to 355 K.; DH

Phase change data

Data compiled as indicated in comments:
BS - Robert L. Brown and Stephen E. Stein
TRC - Thermodynamics Research Center, NIST Boulder Laboratories, Chris Muzny director
AC - William E. Acree, Jr., James S. Chickos
ALS - Hussein Y. Afeefy, Joel F. Liebman, and Stephen E. Stein
CAL - James S. Chickos, William E. Acree, Jr., Joel F. Liebman, Students of Chem 202 (Introduction to the Literature of Chemistry), University of Missouri -- St. Louis
DH - Eugene S. Domalski and Elizabeth D. Hearing

Quantity Value Units Method Reference Comment
Tfus350. ± 30.KAVGN/AAverage of 6 values; Individual data points
Quantity Value Units Method Reference Comment
Ttriple341.23KN/ASchaake, van Miltenburg, et al., 1982, 2Crystal phase 1 phase; Uncertainty assigned by TRC = 0.02 K; TRC
Quantity Value Units Method Reference Comment
Δsub192.kJ/molVBaccanari, Novinski, et al., 1968ALS

Reduced pressure boiling point

Tboil (K) Pressure (bar) Reference Comment
570.70.133Weast and Grasselli, 1989BS
502.20.013Weast and Grasselli, 1989BS

Enthalpy of vaporization

ΔvapH (kJ/mol) Temperature (K) Method Reference Comment
94.4526.AStephenson and Malanowski, 1987Based on data from 511. - 659. K.; AC
121.8386.ME,TEde Kruif, Schaake, et al., 1982Based on data from 371. - 394. K.; AC

Enthalpy of sublimation

ΔsubH (kJ/mol) Temperature (K) Method Reference Comment
143.6298. - 315.TPTDChattopadhyay and Ziemann, 2005Experimental values based on the TPTD method are often inconsistent with values determined using other experimental methods; AC

Enthalpy of fusion

ΔfusH (kJ/mol) Temperature (K) Method Reference Comment
57.0340.4DSCGbabode, Negrier, et al., 2007AC
57.62341.2N/ADomalski and Hearing, 1996AC

Entropy of fusion

ΔfusS (J/mol*K) Temperature (K) Reference Comment
28.87338.Domalski and Hearing, 1996CAL
168.87341.2

Enthalpy of phase transition

ΔHtrs (kJ/mol) Temperature (K) Initial Phase Final Phase Reference Comment
9.177338.0crystaline, IIcrystaline, ISchaake, van Miltenburg, et al., 1982DH
57.618341.23crystaline, IliquidSchaake, van Miltenburg, et al., 1982DH

Entropy of phase transition

ΔStrs (J/mol*K) Temperature (K) Initial Phase Final Phase Reference Comment
27.15338.0crystaline, IIcrystaline, ISchaake, van Miltenburg, et al., 1982DH
168.85341.23crystaline, IliquidSchaake, van Miltenburg, et al., 1982DH

In addition to the Thermodynamics Research Center (TRC) data available from this site, much more physical and chemical property data is available from the following TRC products:

References

Adriaanse, Dekker, et al., 1965
Adriaanse, N.; Dekker, H.; Coops, J., Heats of combustion of normal saturated fatty acids and their methyl esters, Rec. Trav. Chim. Pays/Bas, 1965, 84, 393-407. [all data]

Cox and Pilcher, 1970
Cox, J.D.; Pilcher, G., Thermochemistry of Organic and Organometallic Compounds, Academic Press, New York, 1970, 1-636. [all data]

Schaake, van Miltenburg, et al., 1982
Schaake, R.C.F.; van Miltenburg, J.C.; De Kruif, C.G., Thermodynamic properties of the normal alkanoic acids. I. Molar heat capacities of seven odd-numbered normal alkanoic acids, J. Chem. Thermodynam., 1982, 14, 763-769. [all data]

Schaake, van Miltenburg, et al., 1982, 2
Schaake, R.C.F.; van Miltenburg, J.C.; De Kruif, C.G., Thermodynamic properties of the normal alkanoic acids. I. Molar heat capacities of seven odd-numbered normal alkanoic acids., J. Chem. Thermodyn., 1982, 14, 763. [all data]

Baccanari, Novinski, et al., 1968
Baccanari, D.P.; Novinski, J.A.; Pan, Y.; Yevitz, M.M.; Swain, H.A., Jr., Heats of sublimation and vaporization at 25° of long chain fatty acids and methyl esters, Trans. Faraday Soc., 1968, 64, 1201. [all data]

Weast and Grasselli, 1989
CRC Handbook of Data on Organic Compounds, 2nd Editon, Weast,R.C and Grasselli, J.G., ed(s)., CRC Press, Inc., Boca Raton, FL, 1989, 1. [all data]

Stephenson and Malanowski, 1987
Stephenson, Richard M.; Malanowski, Stanislaw, Handbook of the Thermodynamics of Organic Compounds, 1987, https://doi.org/10.1007/978-94-009-3173-2 . [all data]

de Kruif, Schaake, et al., 1982
de Kruif, C.G.; Schaake, R.C.F.; van Miltenburg, J.C.; van der Klauw, K.; Blok, J.G., Thermodynamic properties of the normal alkanoic acids III. Enthalpies of vaporization and vapour pressures of 13 normal alkanoic acids, The Journal of Chemical Thermodynamics, 1982, 14, 8, 791-798, https://doi.org/10.1016/0021-9614(82)90176-8 . [all data]

Chattopadhyay and Ziemann, 2005
Chattopadhyay, Sulekha; Ziemann, Paul J., Vapor Pressures of Substituted and Unsubstituted Monocarboxylic and Dicarboxylic Acids Measured Using an Improved Thermal Desorption Particle Beam Mass Spectrometry Method, Aerosol Science and Technology, 2005, 39, 11, 1085-1100, https://doi.org/10.1080/02786820500421547 . [all data]

Gbabode, Negrier, et al., 2007
Gbabode, Gabin; Negrier, Philippe; Mondieig, Denise; Moreno Calvo, Evelyn; Calvet, Teresa; Cuevas-Diarte, Miquel Àngel, Structures of the High-Temperature Solid Phases of the Odd-Numbered Fatty Acids from Tridecanoic Acid to Tricosanoic Acid, Chem. Eur. J., 2007, 13, 11, 3150-3159, https://doi.org/10.1002/chem.200600955 . [all data]

Domalski and Hearing, 1996
Domalski, Eugene S.; Hearing, Elizabeth D., Heat Capacities and Entropies of Organic Compounds in the Condensed Phase. Volume III, J. Phys. Chem. Ref. Data, 1996, 25, 1, 1, https://doi.org/10.1063/1.555985 . [all data]