Hexane, 1-nitro-

Kovats' RI, non-polar column, isothermal

Data compiled by: NIST Mass Spectrometry Data Center, William E. Wallace, director

Column type CapillaryCapillaryCapillaryCapillaryCapillary
Active phase HP-1HP-1HP-1HP-1HP-1
Column length (m) 30.30.30.30.30.
Carrier gas N2N2N2N2N2
Substrate
Column diameter (mm)
Phase thickness (μm) 1.051.051.051.051.05
Temperature (C) 100.110.120.30.40.
I 1011.71013.61015.41001.21003.5
ReferenceGörgényi and Héberger, 2003Görgényi and Héberger, 2003Görgényi and Héberger, 2003Görgényi and Héberger, 2003Görgényi and Héberger, 2003
Comment MSDC-RI MSDC-RI MSDC-RI MSDC-RI MSDC-RI
Column type CapillaryCapillaryCapillaryCapillaryCapillary
Active phase HP-1HP-1HP-1HP-1HP-1
Column length (m) 30.30.30.30.30.
Carrier gas N2N2N2N2N2
Substrate
Column diameter (mm)
Phase thickness (μm) 1.051.051.051.051.05
Temperature (C) 50.60.70.80.90.
I 1004.41005.81006.61008.41010.
ReferenceGörgényi and Héberger, 2003Görgényi and Héberger, 2003Görgényi and Héberger, 2003Görgényi and Héberger, 2003Görgényi and Héberger, 2003
Comment MSDC-RI MSDC-RI MSDC-RI MSDC-RI MSDC-RI
Column type CapillaryCapillaryCapillaryPackedPacked
Active phase DB-1MSDB-1DB-5ApolaneApiezon L
Column length (m) 30.30.30.3.72.3
Carrier gas HeHe  N2
Substrate     DCMS-treated Chromosorb W
Column diameter (mm) 0.250.250.25
Phase thickness (μm) 0.250.250.25
Temperature (C) 90.90.140.130.100.
I 1009.71009.41057.28970.992.
ReferenceVickers, Kuhn, et al., 2003Vickers, Kuhn, et al., 2003Hobbs and Conde, 1992Dutoit, 1991Brown, Chapman, et al., 1968
Comment MSDC-RI MSDC-RI MSDC-RI MSDC-RI MSDC-RI
Column type Packed
Active phase Apiezon L
Column length (m) 2.3
Carrier gas N2
Substrate DCMS-treated Chromosorb W
Column diameter (mm)
Phase thickness (μm)
Temperature (C) 150.
I 1008.
ReferenceBrown, Chapman, et al., 1968
Comment MSDC-RI

Phase change data

Data compiled by: Robert L. Brown and Stephen E. Stein

Reduced pressure boiling point

Tboil (K) Pressure (bar) Reference
364.70.032Aldrich Chemical Company Inc., 1990

References

Görgényi and Héberger, 2003
Görgényi, M.; Héberger, K., Minimum in the temperature dependence of the Kováts retention indices of nitroalkanes and alkanenitriles on an apolar phase, J. Chromatogr. A, 2003, 985, 1-2, 11-19, https://doi.org/10.1016/S0021-9673(02)01842-3 . [all data]

Vickers, Kuhn, et al., 2003
Vickers, A.K.; Kuhn, E.; Lautamo, R., A novel, inert, low bleed column for GC-MS, 2003, retrieved from http://www.chem.agilent.com/cag/cabu/gcapps.htm. [all data]

Hobbs and Conde, 1992
Hobbs, J.R.; Conde, E.P., Gas chromatographic retention indices of explosives and nitro-compounds in Advances in Analysis and Detection of Explosives: Proceedings of the 4th International Symposium on Analysis of Detection of Explosives, September 7-10, 1992, Jerusalem Israel, J. Yinon, ed(s)., Kluwer Academic Publishers, Netherlands, 1992, 153-164. [all data]

Dutoit, 1991
Dutoit, J., Gas chromatographic retention behaviour of some solutes on structurally similar polar and non-polar stationary phases, J. Chromatogr., 1991, 555, 1-2, 191-204, https://doi.org/10.1016/S0021-9673(01)87179-X . [all data]

Brown, Chapman, et al., 1968
Brown, I.; Chapman, I.L.; Nicholson, G.J., Gas chromatography of polar solutes in electron acceptor stationary phases, Aust. J. Chem., 1968, 21, 5, 1125-1141, https://doi.org/10.1071/CH9681125 . [all data]