4-Methylpyrrolo[1,2-a]pyrazine

Van Den Dool and Kratz RI, polar column, custom temperature program

Data compiled by: NIST Mass Spectrometry Data Center, William E. Wallace, director

Column type Capillary
Active phase Carbowax 20M
Column length (m) 50.
Carrier gas
Substrate
Column diameter (mm) 0.3
Phase thickness (μm)
Program not specified
I 2093.
ReferenceBaltes and Bochmann, 1987
Comment MSDC-RI

Normal alkane RI, non-polar column, temperature ramp

Data compiled by: NIST Mass Spectrometry Data Center, William E. Wallace, director

Column type CapillaryCapillary
Active phase HP-5 MSHP-5
Column length (m) 30.30.
Carrier gas HeliumHe
Substrate
Column diameter (mm) 0.250.25
Phase thickness (μm) 0.250.25
Tstart (C) 45.45.
Tend (C) 280.280.
Heat rate (K/min) 15.15.
Initial hold (min)  2.
Final hold (min)  11.4
I 1340.1340.
ReferenceWanakhachornkrai and Lertsiri, 9999Wanakhachornkrai and Lertsiri, 2003
Comment MSDC-RI MSDC-RI

References

Baltes and Bochmann, 1987
Baltes, W.; Bochmann, G., Model reactions on roast aroma formation. 1. Reaction of serine and threonine with sucrose under the conditions of coffee roasting and identification of new coffee aroma compounds, J. Agric. Food Chem., 1987, 35, 3, 340-346, https://doi.org/10.1021/jf00075a015 . [all data]