mercury distearate

Phase change data

Data compiled as indicated in comments:
TRC - Thermodynamics Research Center, NIST Boulder Laboratories, Chris Muzny director
DH - Eugene S. Domalski and Elizabeth D. Hearing

Quantity Value Units Method Reference Comment
Tfus393.2KN/AAdeosun, 1978Crystal phase 1 phase; Uncertainty assigned by TRC = 0.2 K; TRC

Enthalpy of phase transition

ΔHtrs (kJ/mol) Temperature (K) Initial Phase Final Phase Reference Comment
4.400355.2crystaline, IIcrystaline, IAdeosun, 1978, 2DH
116.500383.2crystaline, IliquidAdeosun, 1978, 2DH

Entropy of phase transition

ΔStrs (J/mol*K) Temperature (K) Initial Phase Final Phase Reference Comment
12.4355.2crystaline, IIcrystaline, IAdeosun, 1978, 2DH
296.3383.2crystaline, IliquidAdeosun, 1978, 2DH

In addition to the Thermodynamics Research Center (TRC) data available from this site, much more physical and chemical property data is available from the following TRC products:

Condensed phase thermochemistry data

Data compiled by: Eugene S. Domalski and Elizabeth D. Hearing

Constant pressure heat capacity of liquid

Cp,liquid (cal/mol*K) Temperature (K) Reference Comment
329.16410.Adeosun, 1978Mean value, 391 to 433 K. Data only graphically for solid.

References

Adeosun, 1978
Adeosun, S.O., A differential thermal analysis study of phase transitions in some mercury(II) carboxylates, J. Thermal Anal., 1978, 14, 235-43. [all data]

Adeosun, 1978, 2
Adeosun, S.O., A differential thermal analysis study of phase transitions in some mercury(II) carboxylates, J. Thermal Anal., 1978, 14, 235-243. [all data]