Fluorene-picric acid

Phase change data

Data compiled as indicated in comments:
TRC - Thermodynamics Research Center, NIST Boulder Laboratories, Chris Muzny director
DH - Eugene S. Domalski and Elizabeth D. Hearing

Quantity Value Units Method Reference Comment
Tfus350.3KN/AFarrell and Shahidi, 1979Uncertainty assigned by TRC = 0.7 K; TRC

Enthalpy of fusion

ΔfusH (kcal/mol) Temperature (K) Reference Comment
6.4054350.3Farrell, Shahidi, et al., 1979DH

Entropy of fusion

ΔfusS (cal/mol*K) Temperature (K) Reference Comment
18.3350.3Farrell, Shahidi, et al., 1979DH

In addition to the Thermodynamics Research Center (TRC) data available from this site, much more physical and chemical property data is available from the following TRC products:

References

Farrell and Shahidi, 1979
Farrell, P.G.; Shahidi, F., DSC studies of aromatic hydrocarbon picrates, Thermochim. Acta, 1979, 33, 275. [all data]

Farrell, Shahidi, et al., 1979
Farrell, P.G.; Shahidi, F.; Casellato, F.; Vecchi, C.; Girelli, A., DSC studies of aromatic hydrocarbon picrates, Thermochim. Acta, 1979, 33, 275-280. [all data]