1-Butanamine, 3-methyl-N,N-bis(3-methylbutyl)-

Condensed phase thermochemistry data

Data compiled by: Hussein Y. Afeefy, Joel F. Liebman, and Stephen E. Stein

Quantity Value Units Method Reference Comment
Δfliquid-342.kJ/molCcbLemoult, 1907
Quantity Value Units Method Reference Comment
Δcliquid-10277.kJ/molCcbLemoult, 1907

References

Lemoult, 1907
Lemoult, M.P., Recherches theoriques et experimentales sur les chaleurs de combustion et de formation des composes organiques, Ann. Chim. Phys., 1907, 12, 395-432. [all data]