5-Nitrofuran-2-carboxylic acid

Condensed phase thermochemistry data

Data compiled by: Hussein Y. Afeefy, Joel F. Liebman, and Stephen E. Stein

Quantity Value Units Method Reference Comment
Δfsolid-517.1 ± 0.8kJ/molCcbBalepin, Lebedev, et al., 1980
Quantity Value Units Method Reference Comment
Δcsolid-1879. ± 0.8kJ/molCcbBalepin, Lebedev, et al., 1980

References

Balepin, Lebedev, et al., 1980
Balepin, A.A.; Lebedev, V.P.; Kuznetsova, A.A.; Venter, K.K.; Trushule, M.A.; Lolya, D.O.; Lebedev, Yu.A., Thermochemical properties of α-nitro derivatives of furan, Bull. Acad. Sci. USSR, Div. Chem. Sci., 1980, 601-604. [all data]