4H-Dithieno[2,3-c:3',2'-e]azepine,5-ethyl-5,6-dihydro-

Gas phase ion energetics data

Data compiled by: Sharon G. Lias, Rhoda D. Levin, and Sherif A. Kafafi

Ionization energy determinations

IE (eV) Method Reference Comment
7.9PEMeunier and Pfister-Guillouzo, 1977Vertical value

References

Meunier and Pfister-Guillouzo, 1977
Meunier, P.; Pfister-Guillouzo, G., Etude conformationnelle par spectroscopie photoelectronique de dihydro "epinnes", Can. J. Chem., 1977, 55, 2867. [all data]