Benzene, 1,2,3-trimethoxy-5-methyl-

Normal alkane RI, non-polar column, temperature ramp

Data compiled by: NIST Mass Spectrometry Data Center, William E. Wallace, director

Column type Capillary
Active phase ZB-5
Column length (m) 60.
Carrier gas He
Substrate
Column diameter (mm) 0.25
Phase thickness (μm) 0.25
Tstart (C) 40.
Tend (C) 260.
Heat rate (K/min) 6.
Initial hold (min) 4.6
Final hold (min) 1.
I 1410.
ReferenceJürgens and Dötterl, 2004
Comment MSDC-RI

Phase change data

Data compiled by: Robert L. Brown and Stephen E. Stein

Reduced pressure boiling point

Tboil (K) Pressure (bar) Reference
390.70.007Aldrich Chemical Company Inc., 1990

References

Jürgens and Dötterl, 2004
Jürgens, A.; Dötterl, S., Chemical composition of anther volatiles in Ranunculaceae: genera-specific profiles in Aemone, Aquilegia, Caltha, Pulsatilla, Ranunculus, and Trollius species, American Journal of Botany, 2004, 91, 12, 1969-1980, https://doi.org/10.3732/ajb.91.12.1969 . [all data]