CAS Reg. No. 64417-78-3

Reaction thermochemistry data

Data compiled by: John E. Bartmess

Individual Reactions

(CAS Reg. No. 64417-78-3 • 4294967295lead) + lead = CAS Reg. No. 64417-78-3

By formula: (CAS Reg. No. 64417-78-3 • 4294967295Pb) + Pb = CAS Reg. No. 64417-78-3

Quantity Value Units Method Reference Comment
Δr42.98 ± 0.41kcal/molN/AHo, Polak, et al., 1992gas phase

References

Ho, Polak, et al., 1992
Ho, J.; Polak, M.L.; Lineberger, W.C., Photoelectron Spectroscopy of Group-IV Heavy Metal Dimers - Sn2-, Pb2-, and SnPb-, J. Chem. Phys., 1992, 96, 1, 144, https://doi.org/10.1063/1.462503 . [all data]