HBeBeH

Vibrational and/or electronic energy levels

Data compiled by: Marilyn E. Jacox

State:   X

Vib.
sym.
 No.   Approximate
 type of mode
 cm-1   Med.   Method   References

Σu+ 3 BeH a-stretch 2020 Ne IR Wang and Andrews, 2005
3 BeH a-stretch 1900.6 Ar IR Tague and Andrews, 1993
3 BeH a-stretch 2014.2 H2 IR Wang and Andrews, 2005

Additional references: Jacox, 1998, page 217

References

Wang and Andrews, 2005
Wang, X.; Andrews, L., One-Dimensional BeH, Inorg. Chem., 2005, 44, 3, 610, https://doi.org/10.1021/ic048464b . [all data]

Tague and Andrews, 1993
Tague, T.J., Jr.; Andrews, L., Reactions of beryllium atoms with hydrogen. Matrix infrared spectra of novel product molecules, J. Am. Chem. Soc., 1993, 115, 25, 12111, https://doi.org/10.1021/ja00078a057 . [all data]

Jacox, 1998
Jacox, M.E., Vibrational and electronic energy levels of polyatomic transient molecules: supplement A, J. Phys. Chem. Ref. Data, 1998, 27, 2, 115-393, https://doi.org/10.1063/1.556017 . [all data]