1H-Pyrrolizine, hexahydro-

Phase change data

Data compiled as indicated in comments:
ALS - Hussein Y. Afeefy, Joel F. Liebman, and Stephen E. Stein
DRB - Donald R. Burgess, Jr.

Quantity Value Units Method Reference Comment
Δvap44.4kJ/molEKozina, Timofeeva, et al., 1981ALS
Δvap44.4kJ/molN/AKozina, Timofeeva, et al., 1981DRB

References

Kozina, Timofeeva, et al., 1981
Kozina, M.P.; Timofeeva, L.P.; Gal'chenko, G.L.; Skvortsov, I.M.; Antipova, I.V., Enthalpies of formation of pyrrolizidine and cis-3,7a-H-cis-5,8-H-3,5-dimethylpyrrolizidine. Enthalpy of the cis-trans conversion of pyrrolizidine, J. Gen. Chem. USSR, 1981, 51, 367-372. [all data]