Longiverbenone

Normal alkane RI, non-polar column, custom temperature program

Data compiled by: NIST Mass Spectrometry Data Center, William E. Wallace, director

Column type CapillaryCapillaryCapillaryCapillaryCapillary
Active phase SPB-5SPB-5SE-52BPX-5CP Sil 8 CB
Column length (m)   30.30.50.
Carrier gas   He He
Substrate
Column diameter (mm)   0.320.250.32
Phase thickness (μm)   0.150.250.25
Program not specifiednot specified45C => 1C/min => 100C => 5C/min => 250C (10min)60C(0.2min) => 3K/min => 186C => 10C/min => 240C (5min)70C(5min) => 3C/min => 100C (1min) => 25C/min => 250C (10min)
I 1675.1694.1651.1647.1647.
ReferenceKilani, Ledauphin, et al., 2008Kilani, Ledauphin, et al., 2008Tognolini, Barocelli, et al., 2006Judzentiene and Mockute, 2005Mockute and Judzentiene, 2003
Comment MSDC-RI MSDC-RI MSDC-RI MSDC-RI MSDC-RI
Column type Capillary
Active phase BP-1
Column length (m) 50.
Carrier gas
Substrate
Column diameter (mm) 0.22
Phase thickness (μm) 0.25
Program not specified
I 1632.
ReferenceMuselli, Bighelli, et al., 2000
Comment MSDC-RI

Kovats' RI, non-polar column, temperature ramp

Data compiled by: NIST Mass Spectrometry Data Center, William E. Wallace, director

Column type Capillary
Active phase HP-5MS
Column length (m) 30.
Carrier gas He
Substrate
Column diameter (mm) 0.25
Phase thickness (μm) 0.25
Tstart (C) 60.
Tend (C) 280.
Heat rate (K/min) 3.
Initial hold (min)
Final hold (min)
I 1627.
ReferenceCouladis, Chinou, et al., 2003
Comment MSDC-RI

References

Kilani, Ledauphin, et al., 2008
Kilani, S.; Ledauphin, J.; Bouhlel, I.; Ben Sghaier, M.; Boubaker, J.; Skandrani, I.; Mosrati, R.; Ghedira, K.; Barillier, D.; Chekir-Ghedira, L., Comparative study of Cyperus rotundus essential oil by a modified GC/MS analysis method. Evaluation of its antioxidantt, cytotoxic, and apoptoic effects, Chem. Biodiversity, 2008, 5, 5, 729-742, https://doi.org/10.1002/cbdv.200890069 . [all data]

Tognolini, Barocelli, et al., 2006
Tognolini, M.; Barocelli, E.; Ballabeni, V.; Bruni, R.; Bianchi, A.; Chiavarini, M.; Impicciatore, M., Comparative screening of plant essential oils: Phenylpropanoid moiety as basic core for antiplatelet activity, Life Sciences, 2006, 78, 13, 1419-1432, https://doi.org/10.1016/j.lfs.2005.07.020 . [all data]

Judzentiene and Mockute, 2005
Judzentiene, A.; Mockute, D., The inflorescence and leaf essential oils of Tanacetum vulgare L. var. vulgare growing wild in Lithuania, Biochem. Syst. Ecol., 2005, 33, 5, 487-498, https://doi.org/10.1016/j.bse.2004.11.003 . [all data]

Mockute and Judzentiene, 2003
Mockute, D.; Judzentiene, A., The myrtenol chemotype of essential oil of Tanacetum vulgare L. var. vulgare (tansy) growing wild in the Vilnius region, Chemija, 2003, 14, 2, 103-107. [all data]

Muselli, Bighelli, et al., 2000
Muselli, A.; Bighelli, A.; Hoi, T.M.; Thao, N.T.P.; Thai, T.H.; Casanova, J., Dihydroperillaldehydes from Enhydra fluctuans Lour. essential oil, Flavour Fragr. J., 2000, 15, 5, 299-302, https://doi.org/10.1002/1099-1026(200009/10)15:5<299::AID-FFJ911>3.0.CO;2-I . [all data]