CAS Reg. No. 64177-66-8

Reaction thermochemistry data

Data compiled by: John E. Bartmess

Individual Reactions

(CAS Reg. No. 64177-66-8 • 4294967295Tellurium) + Tellurium = CAS Reg. No. 64177-66-8

By formula: (CAS Reg. No. 64177-66-8 • 4294967295Te) + Te = CAS Reg. No. 64177-66-8

Quantity Value Units Method Reference Comment
Δr220. ± 11.kJ/molN/ASnodgrass, Coe, et al., 1989gas phase

References

Snodgrass, Coe, et al., 1989
Snodgrass, J.T.; Coe, J.V.; McHugh, K.M.; Freidhoff, C.B.; Bowen, K.H., Photoelectron Spectroscopy of the Selenium and Tellurium Containing Negative Ions: SeO2-, Se2- and Te2-, J. Phys. Chem., 1989, 93, 4, 1249, https://doi.org/10.1021/j100341a016 . [all data]