N-(2,6-Dimethylphenyl)pyrrolidine

Gas phase ion energetics data

Data compiled as indicated in comments:
LBLHLM - Sharon G. Lias, John E. Bartmess, Joel F. Liebman, John L. Holmes, Rhoda D. Levin, and W. Gary Mallard

Ionization energy determinations

IE (eV) Method Reference Comment
7.0PERozeboom, Houk, et al., 1982LBLHLM
7.67 ± 0.06PERozeboom, Houk, et al., 1982Vertical value; LBLHLM

References

Rozeboom, Houk, et al., 1982
Rozeboom, M.D.; Houk, K.N.; Searles, S.; Seyedrezai, S.E., Photoelectron spectroscopy of N-aryl cyclic amines. Variable conformations and relationships to gas- and solution-phase basicities, J. Am. Chem. Soc., 1982, 104, 3448. [all data]