1H-Indene, 2,3-dihydro-1-methyl-3-phenyl-

Normal alkane RI, non-polar column, temperature ramp

View large format table.

Column type Active phase I Reference Comment
PackedSE-301660.Khudobina and Zenkevich, 1984Helium, Chromosorb W (80-100 mesh), 50. C @ 0. min, 5. K/min, 250. C @ 0. min; Column length: 1.8 m
PackedSE-301675.Khudobina and Zenkevich, 1984Helium, Chromosorb W (80-100 mesh), 50. C @ 0. min, 5. K/min, 250. C @ 0. min; Column length: 1.8 m

References

Khudobina and Zenkevich, 1984
Khudobina, G.V.; Zenkevich, I.G., Chromato Mass Spectrometric Identification of Dimers in Recycled Styrene, VINITI, # 8039-84, 1984, 14. [all data]