C2H5OONO2

Vibrational and/or electronic energy levels

Data compiled by: Marilyn E. Jacox

State:   X

Vib.
sym.
 No.   Approximate
 type of mode
 cm-1   Med.   Method   References

NO2 a-stretch 1718.9 s gas IR Niki, Maker, et al., 1978
NO2 s-stretch 1297.4 m gas IR Niki, Maker, et al., 1978
NO2 scissors 793.6 w m gas IR Niki, Maker, et al., 1978

Additional references: Jacox, 1994, page 425

References

Niki, Maker, et al., 1978
Niki, H.; Maker, P.D.; Savage, C.M.; Breitenbach, L.P., FTIR spectroscopic observation of peroxyalkyl nitrates formed via ROO + NO2 → ROONO2, Chem. Phys. Lett., 1978, 55, 2, 289, https://doi.org/10.1016/0009-2614(78)87020-1 . [all data]

Jacox, 1994
Jacox, M.E., Vibrational and electronic energy levels of polyatomic transient molecules, American Chemical Society, Washington, DC, 1994, 464. [all data]