2,7-Octadiene-1,6-diol, 2,6-dimethyl-

Van Den Dool and Kratz RI, polar column, temperature ramp

Data compiled by: NIST Mass Spectrometry Data Center, William E. Wallace, director

Column type CapillaryCapillary
Active phase DB-WaxDB-Wax
Column length (m) 30.30.
Carrier gas
Substrate
Column diameter (mm) 0.320.32
Phase thickness (μm) 0.50.5
Tstart (C) 40.40.
Tend (C) 245.245.
Heat rate (K/min) 3.3.
Initial hold (min) 3.3.
Final hold (min) 20.20.
I 2251.2251.
ReferenceOllé, Baumes, et al., 1998Ollé, Baumes, et al., 1998
Comment MSDC-RI MSDC-RI

Normal alkane RI, non-polar column, custom temperature program

Data compiled by: NIST Mass Spectrometry Data Center, William E. Wallace, director

Column type Capillary
Active phase
Column length (m)
Carrier gas
Substrate
Column diameter (mm)
Phase thickness (μm)
Program not specified
I 1336.
ReferenceBrandi, Bar, et al., 2011
Comment MSDC-RI

References

Ollé, Baumes, et al., 1998
Ollé, D.; Baumes, R.L.; Bayonove, C.L.; Lozano, Y.F.; Sznaper, C.; Brillouet, J.-M., Comparison of free and glycosidically linked volatile components from polyembryonic and monoembryonic mango (Mangifera indica L.) cultivars, J. Agric. Food Chem., 1998, 46, 3, 1094-1100, https://doi.org/10.1021/jf9705781 . [all data]