Silane,[1,2,3,4,5,6-benzenehexaylhexakis(methylene)]hexakis[trimethyl-

Gas phase ion energetics data

Data compiled by: Sharon G. Lias, Rhoda D. Levin, and Sherif A. Kafafi

Ionization energy determinations

IE (eV) Method Reference Comment
7.40PEBock and Kaim, 1978Vertical value
7.40PEBock, Kaim, et al., 1977Vertical value

References

Bock and Kaim, 1978
Bock, H.; Kaim, W., Einelektronen-Oxidationen (H3C)3SiCH2-substituierter Benzole in der Gasphase und in Losung, Chem. Ber., 1978, 111, 3552. [all data]

Bock, Kaim, et al., 1977
Bock, H.; Kaim, W.; Rohwer, H.E., Radical ions XI*. One-electron oxidation of alkylsilyl benzenes in the gas phase and in solution, J. Organomet. Chem., 1977, 135, 14. [all data]