1H-Cyclobuta[cd]pentalene,1a,3a,5a,5b-tetrahydro-1-methylene-

Gas phase ion energetics data

Data compiled by: Sharon G. Lias, Rhoda D. Levin, and Sherif A. Kafafi

Ionization energy determinations

IE (eV) Method Reference
8.80PEDomelsmith, Houk, et al., 1978

References

Domelsmith, Houk, et al., 1978
Domelsmith, L.N.; Houk, K.N.; Degenhardt, C.R.; Paquette, L.A., Photoelectron spectra and orbital interactions in methyleneortriquinacenes, J. Am. Chem. Soc., 1978, 100, 100. [all data]